Reaction Details
TargetMu-type opioid receptor
LigandBDBM50148868
Substrate/Competitorn/a
Meas. Tech.ChEMBL_1557466 (CHEMBL3771797)
Ki 18±n/a nM
Citation Bender, AMGriggs, NWGao, CTrask, TJTraynor, JRMosberg, HI Rapid Synthesis of Boc-2',6'-dimethyl-l-tyrosine and Derivatives and Incorporation into Opioid Peptidomimetics. ACS Med Chem Lett6:1199-203 (2015) 
 
Mu-type opioid receptor
Name:Mu-type opioid receptor
Type:G Protein-Coupled Receptor (GPCR)
Mol. Mass.:44503.11
Organism:Rattus norvegicus (rat)
Description:Competition binding assays were carried out using membrane preparations from transfected HN9.10 cells that constitutively expressed the mu opioid receptor.
Residue:398
BDBM50148868
NameBDBM50148868
Synonyms:CHEMBL3770024
TypeSmall organic molecule
Emp. Form.C27H31N3O
Mol. Mass.413.5545
SMILESCc1cccc(C)c1C[C@H](N)C(=O)N[C@@H]1CCNc2ccc(Cc3ccccc3)cc12