Reaction Details
TargetMu-type opioid receptor
LigandBDBM50148910
Substrate/Competitorn/a
Meas. Tech.ChEMBL_1557466 (CHEMBL3771797)
Ki 1.7±n/a nM
Citation Bender, AMGriggs, NWGao, CTrask, TJTraynor, JRMosberg, HI Rapid Synthesis of Boc-2',6'-dimethyl-l-tyrosine and Derivatives and Incorporation into Opioid Peptidomimetics. ACS Med Chem Lett6:1199-203 (2015) 
 
Mu-type opioid receptor
Name:Mu-type opioid receptor
Type:G Protein-Coupled Receptor (GPCR)
Mol. Mass.:44503.11
Organism:Rattus norvegicus (rat)
Description:Competition binding assays were carried out using membrane preparations from transfected HN9.10 cells that constitutively expressed the mu opioid receptor.
Residue:398
BDBM50148910
NameBDBM50148910
Synonyms:CHEMBL3770668
TypeSmall organic molecule
Emp. Form.C26H29N3O2
Mol. Mass.415.5274
SMILESCc1cc(O)ccc1C[C@H](N)C(=O)N[C@@H]1CCNc2ccc(Cc3ccccc3)cc12