Reaction Details
TargetPhospholipase A2, membrane associated
LigandBDBM50149981
Substrate/Competitorn/a
Meas. Tech.ChEMBL_1558489 (CHEMBL3773524)
IC50 143±n/a nM
Citation Vasilakaki, SBarbayianni, ELeonis, GPapadopoulos, MGMavromoustakos, TGelb, MHKokotos, G Development of a potent 2-oxoamide inhibitor of secreted phospholipase A2 guided by molecular docking calculations and molecular dynamics simulations. Bioorg Med Chem24:1683-95 (2016) 
 
Phospholipase A2, membrane associated
Name:Phospholipase A2, membrane associated
Type:Hydrolase
Mol. Mass.:16101.20
Organism:Homo sapiens (Human)
Description:The human nps PLA2 was cloned, and expressed in E. coli. There was a refolding process in the purification.
Residue:144
BDBM50149981
NameBDBM50149981
Synonyms:CHEMBL3769794
TypeSmall organic molecule
Emp. Form.C21H39NO4
Mol. Mass.369.5387
(=O)C(=O)N[C@@H](C(C)C)C(O)=O