Reaction Details
TargetPhospholipase A2 group V
LigandBDBM50149981
Substrate/Competitorn/a
Meas. Tech.ChEMBL_1558490 (CHEMBL3773525)
IC50 1200±n/a nM
Citation Vasilakaki, SBarbayianni, ELeonis, GPapadopoulos, MGMavromoustakos, TGelb, MHKokotos, G Development of a potent 2-oxoamide inhibitor of secreted phospholipase A2 guided by molecular docking calculations and molecular dynamics simulations. Bioorg Med Chem24:1683-95 (2016) 
 
Phospholipase A2 group V
Name:Phospholipase A2 group V
Type:Protein
Mol. Mass.:15682.61
Organism:Homo sapiens (Human)
Description:n/a
Residue:138
BDBM50149981
NameBDBM50149981
Synonyms:CHEMBL3769794
TypeSmall organic molecule
Emp. Form.C21H39NO4
Mol. Mass.369.5387
(=O)C(=O)N[C@@H](C(C)C)C(O)=O