Reaction Details
TargetGlycogen phosphorylase, muscle form
LigandBDBM50150653
Substrate/Competitorn/a
Meas. Tech.ChEMBL_1558648 (CHEMBL3771525)
IC50 2500±n/a nM
Citation Loughlin, WAJenkins, IDKaris, NDSchweiker, SSHealy, PC 2-Oxo-1,2-dihydropyridinyl-3-yl amide-based GPa inhibitors: Design, synthesis and structure-activity relationship study. Eur J Med Chem111:1-14 (2016) 
 
Glycogen phosphorylase, muscle form
Name:Glycogen phosphorylase, muscle form
Type:Enzyme
Mol. Mass.:97296.32
Organism:Oryctolagus cuniculus (rabbit)
Description:Phosphorylation of Ser-15 converts phosphorylase B (unphosphorylated) to phosphorylase A.
Residue:843
BDBM50150653
NameBDBM50150653
Synonyms:CHEMBL3770692
TypeSmall organic molecule
Emp. Form.C21H18Cl2N4O4
Mol. Mass.461.298
SMILES[O-][N+](=O)c1ccc(CNc2cccn(CC(=O)NCc3ccc(Cl)c(Cl)c3)c2=O)cc1