Reaction Details
TargetDisintegrin and metalloproteinase domain-containing protein 10
LigandBDBM50441213
Substrate/Competitorn/a
Meas. Tech.ChEMBL_1559069 (CHEMBL3773925)
IC50 15000±n/a nM
Citation Camodeca, CNuti, ETepshi, LBoero, STuccinardi, TStura, EAPoggi, AZocchi, MRRossello, A Discovery of a new selective inhibitor of A Disintegrin And Metalloprotease 10 (ADAM-10) able to reduce the shedding of NKG2D ligands in Hodgkin's lymphoma cell models. Eur J Med Chem111:193-201 (2016) 
 
Disintegrin and metalloproteinase domain-containing protein 10
Name:Disintegrin and metalloproteinase domain-containing protein 10
Type:Enzyme
Mol. Mass.:84160.93
Organism:Homo sapiens (Human)
Description:O14672
Residue:748
BDBM50441213
NameBDBM50441213
Synonyms:CHEMBL2431027
TypeSmall organic molecule
Emp. Form.C26H27Br2N3O7S
Mol. Mass.685.381
SMILESONC(=O)[C@@H](CCCNC(=O)OCc1ccccc1)NS(=O)(=O)c1ccc(OCc2cc(Br)cc(Br)c2)cc1