Reaction Details
TargetSigma non-opioid intracellular receptor 1
LigandBDBM50151272
Substrate/Competitorn/a
Meas. Tech.ChEMBL_1559078 (CHEMBL3773934)
Ki 0.741310±n/a nM
Citation Franchini, SBattisti, UMPrandi, ATait, ABorsari, CCichero, EFossa, PCilia, APrezzavento, ORonsisvalle, SAricò, GParenti, CBrasili, L Scouting new sigma receptor ligands: Synthesis, pharmacological evaluation and molecular modeling of 1,3-dioxolane-based structures and derivatives. Eur J Med Chem112:1-19 (2016) 
 
Sigma non-opioid intracellular receptor 1
Name:Sigma non-opioid intracellular receptor 1
Type:Protein
Mol. Mass.:25307.17
Organism:Cavia porcellus (Guinea pig)
Description:Q60492
Residue:223
BDBM50151272
NameBDBM50151272
Synonyms:CHEMBL3769930
TypeSmall organic molecule
Emp. Form.C20H30N2O2
Mol. Mass.330.4644
SMILESC(C1COC2(CCCCC2)O1)N1CCN(Cc2ccccc2)CC1