Reaction Details
TargetMelanocortin receptor 4
LigandBDBM50138301
Substrate/Competitorn/a
Meas. Tech.ChEMBL_1560591 (CHEMBL3777323)
Ki 2.0±n/a nM
Citation Dosa, PIAmin, EA Tactical Approaches to Interconverting GPCR Agonists and Antagonists. J Med Chem59:810-40 (2016) 
 
Melanocortin receptor 4
Name:Melanocortin receptor 4
Type:Enzyme
Mol. Mass.:36949.50
Organism:Homo sapiens (Human)
Description:P32245
Residue:332
BDBM50138301
NameBDBM50138301
Synonyms:4-[(S)-4-(4-{2-[1-(Acetyl-ethyl-amino)-ethyl]-phenyl}-piperazin-1-yl)-3-(4-chloro-benzyl)-4-oxo-butyryl]-piperazine-1-carboxylic acid tert-butyl ester | CHEMBL124954
TypeSmall organic molecule
Emp. Form.C36H50ClN5O5
Mol. Mass.668.266
SMILESCCN(C(C)c1ccccc1N1CCN(CC1)C(=O)[C@H](CC(=O)N1CCN(CC1)C(=O)OC(C)(C)C)Cc1ccc(Cl)cc1)C(C)=O