Reaction Details
Target5-hydroxytryptamine receptor 1A
LigandBDBM50118335
Substrate/Competitorn/a
Meas. Tech.ChEMBL_1560588 (CHEMBL3777320)
Ki 6.0±n/a nM
Citation Dosa, PIAmin, EA Tactical Approaches to Interconverting GPCR Agonists and Antagonists. J Med Chem59:810-40 (2016) 
 
5-hydroxytryptamine receptor 1A
Name:5-hydroxytryptamine receptor 1A
Type:G Protein-Coupled Receptor (GPCR)
Mol. Mass.:46445.29
Organism:Rattus norvegicus (rat)
Description:Binding assays were performed using rat hippocampal membranes.
Residue:422
BDBM50118335
NameBDBM50118335
Synonyms:3-(4-(2,3-dihydrobenzo[b][1,4]dioxin-5-yl)piperazin-1-yl)-1-(5-fluorobenzo[b]thiophen-3-yl)propan-1-ol CHEMBL336842
TypeSmall organic molecule
Emp. Form.C23H25FN2O3S
Mol. Mass.428.52
SMILESOC(CCN1CCN(CC1)c1cccc2OCCOc12)c1csc2ccc(F)cc12