Reaction Details
TargetCannabinoid receptor 2
LigandBDBM50154622
Substrate/Competitorn/a
Meas. Tech.ChEMBL_1561408 (CHEMBL3778968)
IC50 865±n/a nM
Citation Aghazadeh Tabrizi, MBaraldi, PGRuggiero, ESaponaro, GBaraldi, SPoli, GTuccinardi, TRavani, AVincenzi, FBorea, PAVarani, K Synthesis and structure activity relationship investigation of triazolo[1,5-a]pyrimidines as CB2 cannabinoid receptor inverse agonists. Eur J Med Chem113:11-27 (2016) 
 
Cannabinoid receptor 2
Name:Cannabinoid receptor 2
Type:G Protein-Coupled Receptor (GPCR)
Mol. Mass.:39690.94
Organism:Homo sapiens (Human)
Description:P34972
Residue:360
BDBM50154622
NameBDBM50154622
Synonyms:CHEMBL3774406
TypeSmall organic molecule
Emp. Form.C22H31N5O2
Mol. Mass.397.5138
SMILESCCCCCn1cc(C(=O)NC23CC4CC(CC(C4)C2)C3)c(=O)n2nc(C)nc12