Reaction Details
TargetCannabinoid receptor 2
LigandBDBM50154630
Substrate/Competitorn/a
Meas. Tech.ChEMBL_1561403 (CHEMBL3778963)
Ki 982±n/a nM
Citation Aghazadeh Tabrizi, MBaraldi, PGRuggiero, ESaponaro, GBaraldi, SPoli, GTuccinardi, TRavani, AVincenzi, FBorea, PAVarani, K Synthesis and structure activity relationship investigation of triazolo[1,5-a]pyrimidines as CB2 cannabinoid receptor inverse agonists. Eur J Med Chem113:11-27 (2016) 
 
Cannabinoid receptor 2
Name:Cannabinoid receptor 2
Type:G Protein-Coupled Receptor (GPCR)
Mol. Mass.:39690.94
Organism:Homo sapiens (Human)
Description:P34972
Residue:360
BDBM50154630
NameBDBM50154630
Synonyms:CHEMBL3774589
TypeSmall organic molecule
Emp. Form.C23H37N7O2
Mol. Mass.443.5856
SMILESCCCCCn1cc(C(=O)NC2CCCCCC2)c(=O)n2nc(nc12)N1CCN(C)CC1