Reaction Details
TargetCannabinoid receptor 1
LigandBDBM50152108
Substrate/Competitorn/a
Meas. Tech.ChEMBL_1565145 (CHEMBL3782503)
Ki>10000±n/a nM
Citation Deiana, VGómez-Cañas, MPazos, MRFernández-Ruiz, JAsproni, BCichero, EFossa, PMuñoz, EDeligia, FMurineddu, GGarcía-Arencibia, MPinna, GA Tricyclic pyrazoles. Part 8. Synthesis, biological evaluation and modelling of tricyclic pyrazole carboxamides as potential CB2 receptor ligands with antagonist/inverse agonist properties. Eur J Med Chem112:66-80 (2016) 
 
Cannabinoid receptor 1
Name:Cannabinoid receptor 1
Type:G Protein-Coupled Receptor (GPCR)
Mol. Mass.:52868.96
Organism:Homo sapiens (Human)
Description:P21554
Residue:472
BDBM50152108
NameBDBM50152108
Synonyms:CHEMBL3780282
TypeSmall organic molecule
Emp. Form.C25H23Cl2N3O
Mol. Mass.452.376
SMILESClc1ccc(c(Cl)c1)-n1nc(C(=O)N2CCCCC2)c2Cc3cc(ccc3-c12)C1CC1