Reaction Details
TargetCannabinoid receptor 2
LigandBDBM50152103
Substrate/Competitorn/a
Meas. Tech.ChEMBL_1565146 (CHEMBL3782504)
Ki 515±n/a nM
Citation Deiana, VGómez-Cañas, MPazos, MRFernández-Ruiz, JAsproni, BCichero, EFossa, PMuñoz, EDeligia, FMurineddu, GGarcía-Arencibia, MPinna, GA Tricyclic pyrazoles. Part 8. Synthesis, biological evaluation and modelling of tricyclic pyrazole carboxamides as potential CB2 receptor ligands with antagonist/inverse agonist properties. Eur J Med Chem112:66-80 (2016) 
 
Cannabinoid receptor 2
Name:Cannabinoid receptor 2
Type:G Protein-Coupled Receptor (GPCR)
Mol. Mass.:39690.94
Organism:Homo sapiens (Human)
Description:P34972
Residue:360
BDBM50152103
NameBDBM50152103
Synonyms:CHEMBL3780680
TypeSmall organic molecule
Emp. Form.C27H28Cl2N4O
Mol. Mass.495.443
SMILESClc1ccc(c(Cl)c1)-n1nc(C(=O)NN2CCCC2)c2Cc3cc(ccc3-c12)C1CCCCC1