Reaction Details
TargetCannabinoid receptor 2
LigandBDBM50152106
Substrate/Competitorn/a
Meas. Tech.ChEMBL_1565146 (CHEMBL3782504)
Ki>40000±n/a nM
Citation Deiana, VGómez-Cañas, MPazos, MRFernández-Ruiz, JAsproni, BCichero, EFossa, PMuñoz, EDeligia, FMurineddu, GGarcía-Arencibia, MPinna, GA Tricyclic pyrazoles. Part 8. Synthesis, biological evaluation and modelling of tricyclic pyrazole carboxamides as potential CB2 receptor ligands with antagonist/inverse agonist properties. Eur J Med Chem112:66-80 (2016) 
 
Cannabinoid receptor 2
Name:Cannabinoid receptor 2
Type:G Protein-Coupled Receptor (GPCR)
Mol. Mass.:39690.94
Organism:Homo sapiens (Human)
Description:P34972
Residue:360
BDBM50152106
NameBDBM50152106
Synonyms:CHEMBL3780124
TypeSmall organic molecule
Emp. Form.C25H22Cl2N4O
Mol. Mass.465.374
SMILESClc1ccc(c(Cl)c1)-n1nc(C(=O)NN2CCCC2)c2ccc3cc(ccc3c12)C1CC1