Reaction Details
TargetCannabinoid receptor 2
LigandBDBM50152109
Substrate/Competitorn/a
Meas. Tech.ChEMBL_1565146 (CHEMBL3782504)
Ki 198±n/a nM
Citation Deiana, VGómez-Cañas, MPazos, MRFernández-Ruiz, JAsproni, BCichero, EFossa, PMuñoz, EDeligia, FMurineddu, GGarcía-Arencibia, MPinna, GA Tricyclic pyrazoles. Part 8. Synthesis, biological evaluation and modelling of tricyclic pyrazole carboxamides as potential CB2 receptor ligands with antagonist/inverse agonist properties. Eur J Med Chem112:66-80 (2016) 
 
Cannabinoid receptor 2
Name:Cannabinoid receptor 2
Type:G Protein-Coupled Receptor (GPCR)
Mol. Mass.:39690.94
Organism:Homo sapiens (Human)
Description:P34972
Residue:360
BDBM50152109
NameBDBM50152109
Synonyms:CHEMBL3781707
TypeSmall organic molecule
Emp. Form.C24H22Cl2N4O2
Mol. Mass.469.363
SMILESClc1ccc(c(Cl)c1)-n1nc(C(=O)NN2CCOCC2)c2Cc3cc(ccc3-c12)C1CC1