Reaction Details
TargetCannabinoid receptor 2
LigandBDBM50152116
Substrate/Competitorn/a
Meas. Tech.ChEMBL_1565146 (CHEMBL3782504)
Ki 6.0±n/a nM
Citation Deiana, VGómez-Cañas, MPazos, MRFernández-Ruiz, JAsproni, BCichero, EFossa, PMuñoz, EDeligia, FMurineddu, GGarcía-Arencibia, MPinna, GA Tricyclic pyrazoles. Part 8. Synthesis, biological evaluation and modelling of tricyclic pyrazole carboxamides as potential CB2 receptor ligands with antagonist/inverse agonist properties. Eur J Med Chem112:66-80 (2016) 
 
Cannabinoid receptor 2
Name:Cannabinoid receptor 2
Type:G Protein-Coupled Receptor (GPCR)
Mol. Mass.:39690.94
Organism:Homo sapiens (Human)
Description:P34972
Residue:360
BDBM50152116
NameBDBM50152116
Synonyms:CHEMBL3781131
TypeSmall organic molecule
Emp. Form.C30H31Cl2N3O
Mol. Mass.520.493
SMILESC[C@]12CCC(C1)C(C)(C)C2NC(=O)c1nn(c-2c1Cc1cc(ccc-21)C1CC1)-c1ccc(Cl)cc1Cl