Reaction Details
TargetATP-dependent translocase ABCB1
LigandBDBM50153722
Substrate/Competitorn/a
Meas. Tech.ChEBML_1561530
Ki 540±n/a nM
Citation Callies, OSánchez-Cañete, MPGamarro, FJiménez, IACastanys, SBazzocchi, IL Optimization by Molecular Fine Tuning of Dihydro-ß-agarofuran Sesquiterpenoids as Reversers of P-Glycoprotein-Mediated Multidrug Resistance. J Med Chem59:1880-90 (2016) 
 
ATP-dependent translocase ABCB1
Name:ATP-dependent translocase ABCB1
Type:Protein
Mol. Mass.:141503.50
Organism:Homo sapiens (Human)
Description:P08183
Residue:1280
BDBM50153722
NameBDBM50153722
Synonyms:CHEMBL3774613
TypeSmall organic molecule
Emp. Form.C36H42O10
Mol. Mass.634.7127
SMILES[H][C@@]12[C@@H](OC(=O)CC)[C@]3(OC1(C)C)[C@@](C)(O)CC[C@H](OC(C)=O)[C@@]3(C)[C@@H](OC(=O)c1ccccc1)[C@H]2OC(=O)\C=C\c1ccccc1