Reaction Details
TargetATP-dependent translocase ABCB1
LigandBDBM50154912
Substrate/Competitorn/a
Meas. Tech.ChEMBL_1561530 (CHEMBL3776167)
Ki 400±n/a nM
Citation Callies, OSánchez-Cañete, MPGamarro, FJiménez, IACastanys, SBazzocchi, IL Optimization by Molecular Fine Tuning of Dihydro-ß-agarofuran Sesquiterpenoids as Reversers of P-Glycoprotein-Mediated Multidrug Resistance. J Med Chem59:1880-90 (2016) 
 
ATP-dependent translocase ABCB1
Name:ATP-dependent translocase ABCB1
Type:Protein
Mol. Mass.:141503.50
Organism:Homo sapiens (Human)
Description:P08183
Residue:1280
BDBM50154912
NameBDBM50154912
Synonyms:CHEMBL3774875
TypeSmall organic molecule
Emp. Form.C33H40O8
Mol. Mass.564.6659
SMILES[H][C@@]12[C@@H](O)[C@]3(OC1(C)C)[C@H](C)CC[C@H](OC(C)=O)[C@@]3(C)[C@@H](OC(=O)c1ccccc1)[C@H]2OC(=O)CCc1ccccc1