Reaction Details
TargetDual specificity tyrosine-phosphorylation-regulated kinase 2
LigandBDBM50154350
Substrate/Competitorn/a
Meas. Tech.ChEMBL_1560174 (CHEMBL3778245)
IC50 820±n/a nM
Citation Mariano, MHartmann, RWEngel, M Systematic diversification of benzylidene heterocycles yields novel inhibitor scaffolds selective for Dyrk1A, Clk1 and CK2. Eur J Med Chem112:209-16 (2016) 
 
Dual specificity tyrosine-phosphorylation-regulated kinase 2
Name:Dual specificity tyrosine-phosphorylation-regulated kinase 2
Type:PROTEIN
Mol. Mass.:66690.69
Organism:Homo sapiens (Human)
Description:ChEMBL_1508025
Residue:601
BDBM50154350
NameBDBM50154350
Synonyms:CHEMBL3775821
TypeSmall organic molecule
Emp. Form.C13H12O3
Mol. Mass.216.2326
SMILESO=C1OCC\C1=C/c1ccc2OCCc2c1