Reaction Details
TargetDual specificity tyrosine-phosphorylation-regulated kinase 1B
LigandBDBM50154341
Substrate/Competitorn/a
Meas. Tech.ChEMBL_1560173 (CHEMBL3778244)
IC50 900±n/a nM
Citation Mariano, MHartmann, RWEngel, M Systematic diversification of benzylidene heterocycles yields novel inhibitor scaffolds selective for Dyrk1A, Clk1 and CK2. Eur J Med Chem112:209-16 (2016) 
 
Dual specificity tyrosine-phosphorylation-regulated kinase 1B
Name:Dual specificity tyrosine-phosphorylation-regulated kinase 1B
Type:Enzyme
Mol. Mass.:69222.24
Organism:Homo sapiens (Human)
Description:Q9Y463
Residue:629
BDBM50154341
NameBDBM50154341
Synonyms:CHEMBL3775754
TypeSmall organic molecule
Emp. Form.C11H7N3OS2
Mol. Mass.261.323
SMILESO=C1NC(=S)N\C1=C/c1ccc2ncsc2c1