Reaction Details
TargetDual specificity tyrosine-phosphorylation-regulated kinase 1A
LigandBDBM50154351
Substrate/Competitorn/a
Meas. Tech.ChEMBL_1560172 (CHEMBL3778243)
IC50 250±n/a nM
Citation Mariano, MHartmann, RWEngel, M Systematic diversification of benzylidene heterocycles yields novel inhibitor scaffolds selective for Dyrk1A, Clk1 and CK2. Eur J Med Chem112:209-16 (2016) 
 
Dual specificity tyrosine-phosphorylation-regulated kinase 1A
Name:Dual specificity tyrosine-phosphorylation-regulated kinase 1A
Type:Enzyme
Mol. Mass.:85616.61
Organism:Homo sapiens (Human)
Description:Q13627
Residue:763
BDBM50154351
NameBDBM50154351
Synonyms:CHEMBL3775949
TypeSmall organic molecule
Emp. Form.C11H9NO2S2
Mol. Mass.251.325
SMILESCOc1ccc(\C=C2\SC(=S)NC2=O)cc1