Reaction Details
TargetDual specificity tyrosine-phosphorylation-regulated kinase 1A
LigandBDBM50154354
Substrate/Competitorn/a
Meas. Tech.ChEMBL_1560172 (CHEMBL3778243)
IC50 930±n/a nM
Citation Mariano, MHartmann, RWEngel, M Systematic diversification of benzylidene heterocycles yields novel inhibitor scaffolds selective for Dyrk1A, Clk1 and CK2. Eur J Med Chem112:209-16 (2016) 
 
Dual specificity tyrosine-phosphorylation-regulated kinase 1A
Name:Dual specificity tyrosine-phosphorylation-regulated kinase 1A
Type:Enzyme
Mol. Mass.:85616.61
Organism:Homo sapiens (Human)
Description:Q13627
Residue:763
BDBM50154354
NameBDBM50154354
Synonyms:CHEMBL3775193
TypeSmall organic molecule
Emp. Form.C14H14O3
Mol. Mass.230.2592
SMILESO=C1OCC\C1=C/c1ccc2OCCCc2c1