Reaction Details
TargetProtein kinase C beta type
LigandBDBM50154343
Substrate/Competitorn/a
Meas. Tech.ChEMBL_1560178 (CHEMBL3778249)
IC50 9200±n/a nM
Citation Mariano, MHartmann, RWEngel, M Systematic diversification of benzylidene heterocycles yields novel inhibitor scaffolds selective for Dyrk1A, Clk1 and CK2. Eur J Med Chem112:209-16 (2016) 
 
Protein kinase C beta type
Name:Protein kinase C beta type
Type:Enzyme
Mol. Mass.:76873.67
Organism:Homo sapiens (Human)
Description:The recombinant human PKC enzymes were produced using a baculovirus expression system in SF9 cells
Residue:671
BDBM50154343
NameBDBM50154343
Synonyms:CHEMBL3775393
TypeSmall organic molecule
Emp. Form.C11H6N2OS3
Mol. Mass.278.373
SMILESO=C1NC(=S)S\C1=C/c1ccc2ncsc2c1