Reaction Details
TargetPhosphatidylinositol 4,5-bisphosphate 3-kinase catalytic subunit gamma isoform
LigandBDBM50154342
Substrate/Competitorn/a
Meas. Tech.ChEMBL_1560200 (CHEMBL3778439)
IC50 2.3±n/a nM
Citation Mariano, MHartmann, RWEngel, M Systematic diversification of benzylidene heterocycles yields novel inhibitor scaffolds selective for Dyrk1A, Clk1 and CK2. Eur J Med Chem112:209-16 (2016) 
 
Phosphatidylinositol 4,5-bisphosphate 3-kinase catalytic subunit gamma isoform
Name:Phosphatidylinositol 4,5-bisphosphate 3-kinase catalytic subunit gamma isoform
Type:Enzyme Subunit
Mol. Mass.:126470.30
Organism:Homo sapiens (Human)
Description:P48736
Residue:1102
BDBM50154342
NameBDBM50154342
Synonyms:CHEMBL3774448
TypeSmall organic molecule
Emp. Form.C13H8N2OS2
Mol. Mass.272.345
SMILESO=C1NC(=S)S\C1=C/c1ccc2ncccc2c1