Reaction Details
TargetDual specificity protein kinase CLK1
LigandBDBM50154344
Substrate/Competitorn/a
Meas. Tech.ChEMBL_1560176 (CHEMBL3778247)
IC50 500±n/a nM
Citation Mariano, MHartmann, RWEngel, M Systematic diversification of benzylidene heterocycles yields novel inhibitor scaffolds selective for Dyrk1A, Clk1 and CK2. Eur J Med Chem112:209-16 (2016) 
 
Dual specificity protein kinase CLK1
Name:Dual specificity protein kinase CLK1
Type:Protein
Mol. Mass.:57322.21
Organism:Homo sapiens (Human)
Description:P49759
Residue:484
BDBM50154344
NameBDBM50154344
Synonyms:CHEMBL3774830
TypeSmall organic molecule
Emp. Form.C12H9NO2S2
Mol. Mass.263.335
SMILESO=C1NC(=S)S\C1=C/c1ccc2OCCc2c1