Reaction Details
TargetDual specificity tyrosine-phosphorylation-regulated kinase 1A
LigandBDBM50154343
Substrate/Competitorn/a
Meas. Tech.ChEMBL_1560500 (CHEMBL3776531)
IC50 2100±n/a nM
Citation Mariano, MHartmann, RWEngel, M Systematic diversification of benzylidene heterocycles yields novel inhibitor scaffolds selective for Dyrk1A, Clk1 and CK2. Eur J Med Chem112:209-16 (2016) 
 
Dual specificity tyrosine-phosphorylation-regulated kinase 1A
Name:Dual specificity tyrosine-phosphorylation-regulated kinase 1A
Type:Enzyme
Mol. Mass.:85616.61
Organism:Homo sapiens (Human)
Description:Q13627
Residue:763
BDBM50154343
NameBDBM50154343
Synonyms:CHEMBL3775393
TypeSmall organic molecule
Emp. Form.C11H6N2OS3
Mol. Mass.278.373
SMILESO=C1NC(=S)S\C1=C/c1ccc2ncsc2c1