Reaction Details
TargetSerine/threonine-protein kinase pim-1
LigandBDBM50364776
Substrate/Competitorn/a
Meas. Tech.ChEBML_1562791
IC50 48±n/a nM
Citation Li, KLi, YZhou, DFan, YGuo, HMa, TWen, JLiu, DZhao, L Synthesis and biological evaluation of quinoline derivatives as potential anti-prostate cancer agents and Pim-1 kinase inhibitors. Bioorg Med Chem24:1889-97 (2016) 
 
Serine/threonine-protein kinase pim-1
Name:Serine/threonine-protein kinase pim-1
Type:Protein
Mol. Mass.:35681.82
Organism:Homo sapiens (Human)
Description:P11309
Residue:313
BDBM50364776
NameBDBM50364776
Synonyms:CHEMBL1952141 | CHEMBL1952329
TypeSmall organic molecule
Emp. Form.C20H22F3N5O
Mol. Mass.405.4168
SMILESCN1CCC(CNc2ccc3ncc(-c4cccc(OC(F)(F)F)c4)n3n2)CC1