Reaction Details
TargetCyclin-dependent kinase 5
LigandBDBM50154925
Substrate/Competitorn/a
Meas. Tech.ChEMBL_1561740 (CHEMBL3777412)
IC50 8.0±n/a nM
Citation Vymetalová, LHavlícek, L?turc, ASkrá?ková, ZJorda, RPospí?il, TStrnad, MKry?tof, V 5-Substituted 3-isopropyl-7-[4-(2-pyridyl)benzyl]amino-1(2)H-pyrazolo[4,3-d]pyrimidines with anti-proliferative activity as potent and selective inhibitors of cyclin-dependent kinases. Eur J Med Chem110:291-301 (2016) 
 
Cyclin-dependent kinase 5
Name:Cyclin-dependent kinase 5
Type:Enzyme Subunit
Mol. Mass.:33308.61
Organism:Homo sapiens (Human)
Description:n/a
Residue:292
BDBM50154925
NameBDBM50154925
Synonyms:CHEMBL3775470
TypeSmall organic molecule
Emp. Form.C22H26N8
Mol. Mass.402.4954
SMILESCC(C)c1n[nH]c2c(NCc3ccc(cc3)-c3ccccn3)nc(NCCN)nc12