Reaction Details
TargetCyclin-dependent kinase 4
LigandBDBM50139171
Substrate/Competitorn/a
Meas. Tech.ChEMBL_1561546 (CHEMBL3776183)
IC50 127±n/a nM
Citation Vymetalová, LHavlícek, L?turc, ASkrá?ková, ZJorda, RPospí?il, TStrnad, MKry?tof, V 5-Substituted 3-isopropyl-7-[4-(2-pyridyl)benzyl]amino-1(2)H-pyrazolo[4,3-d]pyrimidines with anti-proliferative activity as potent and selective inhibitors of cyclin-dependent kinases. Eur J Med Chem110:291-301 (2016) 
 
Cyclin-dependent kinase 4
Name:Cyclin-dependent kinase 4
Type:Enzyme Subunit
Mol. Mass.:33731.96
Organism:Homo sapiens (Human)
Description:P11802
Residue:303
BDBM50139171
NameBDBM50139171
Synonyms:Dinaciclib SCH-727965 US20230416221, Compound Dinaciclib
TypeSmall organic molecule
Emp. Form.C21H28N6O2
Mol. Mass.396.486
SMILESCCc1cnn2c(NCc3ccc[n+]([O-])c3)cc(nc12)N1CCCC[C@H]1CCO