Reaction Details
Target5-hydroxytryptamine receptor 1B
LigandBDBM10755
Substrate/Competitorn/a
Meas. Tech.ChEMBL_1559791 (CHEMBL3779744)
IC50 4.9±n/a nM
Citation Waszkielewicz, AMGunia-Krzyzak, APowroznik, BSloczynska, KPekala, EWalczak, MBednarski, MZeslawska, ENitek, WMarona, H Design, physico-chemical properties and biological evaluation of some new N-[(phenoxy)alkyl]- and N-{2-[2-(phenoxy)ethoxy]ethyl}aminoalkanols as anticonvulsant agents. Bioorg Med Chem24:1793-810 (2016) 
 
5-hydroxytryptamine receptor 1B
Name:5-hydroxytryptamine receptor 1B
Type:Protein
Mol. Mass.:43173.33
Organism:Rattus norvegicus (Rat)
Description:P28564
Residue:386
BDBM10755
NameBDBM10755
Synonyms:14C-5-hydroxy tryptamine creatinine disulfate 5-HT 5-hydroxy tryptamine creatinine disulfate Serotonin | [3H]-5-HT
TypeSmall organic molecule
Emp. Form.C10H12N2O
Mol. Mass.176.2151
SMILESNCCc1c[nH]c2ccc(O)cc12