Reaction Details
TargetMuscarinic acetylcholine receptor M4
LigandBDBM50176065
Substrate/Competitorn/a
Meas. Tech.ChEMBL_1559774 (CHEMBL3779727)
IC50 0.490±n/a nM
Citation Waszkielewicz, AMGunia-Krzyzak, APowroznik, BSloczynska, KPekala, EWalczak, MBednarski, MZeslawska, ENitek, WMarona, H Design, physico-chemical properties and biological evaluation of some new N-[(phenoxy)alkyl]- and N-{2-[2-(phenoxy)ethoxy]ethyl}aminoalkanols as anticonvulsant agents. Bioorg Med Chem24:1793-810 (2016) 
 
Muscarinic acetylcholine receptor M4
Name:Muscarinic acetylcholine receptor M4
Type:Enzyme Catalytic Domain
Mol. Mass.:53079.31
Organism:Homo sapiens (Human)
Description:Cholinergic, muscarinic M4 CHRM4 HUMAN M3::P08173
Residue:479
BDBM50176065
NameBDBM50176065
Synonyms:4-DAMP Acetic acid 4-[(4-acetoxy-phenyl)-pyridin-2-yl-methyl]-phenyl ester CHEMBL76897
TypeSmall organic molecule
Emp. Form.C21H26NO2
Mol. Mass.324.4361
SMILESC[N+]1(C)CCC(CC1)OC(=O)C(c1ccccc1)c1ccccc1