Reaction Details
TargetTyrosine-protein phosphatase non-receptor type 1
LigandBDBM50155761
Substrate/Competitorn/a
Meas. Tech.ChEMBL_1565351 (CHEMBL3782745)
IC50 7000±n/a nM
Citation Khan, MFAzad, CSKumar, ASaini, MNarula, AKJain, S Novel Imbricatolic acid derivatives as protein tyrosine phosphatase-1B inhibitors: Design, synthesis, biological evaluation and molecular docking. Bioorg Med Chem Lett26:1988-92 (2016) 
 
Tyrosine-protein phosphatase non-receptor type 1
Name:Tyrosine-protein phosphatase non-receptor type 1
Type:Protein phosphatase
Mol. Mass.:49963.76
Organism:Homo sapiens (Human)
Description:Human recombinant GST-fusion PTP1B (1-435).
Residue:435
BDBM50155761
NameBDBM50155761
Synonyms:CHEMBL3782051
TypeSmall organic molecule
Emp. Form.C22H37N3O3
Mol. Mass.391.5475
SMILES[H][C@@]12CCC(=C)[C@H](CC[C@H](C)C\C=N\OC(C)=O)[C@@]1(C)CCC[C@]2(C)NC(N)=O