Reaction Details
TargetLysine-specific demethylase 2B
LigandBDBM50155449
Substrate/Competitorn/a
Meas. Tech.ChEBML_1565734
IC50<250±n/a nM
Citation Abdel-Magid, AF Inhibition of Histone Demethylases Offers a Novel and Promising Approach for the Treatment of Cancer and Other Diseases. ACS Med Chem Lett7:128-30 (2016) 
 
Lysine-specific demethylase 2B
Name:Lysine-specific demethylase 2B
Type:Enzyme Catalytic Domain
Mol. Mass.:152658.35
Organism:Homo sapiens (Human)
Description:Q8NHM5
Residue:1336
BDBM50155449
NameBDBM50155449
Synonyms:CHEMBL3780958
TypeSmall organic molecule
Emp. Form.C22H27N3O4
Mol. Mass.397.4675
SMILESCOc1ccc(cc1)[C@@H](C)N1CCC[C@@H](CNCc2cc(ccn2)C(O)=O)C1=O