Reaction Details
TargetLysine-specific demethylase 2B
LigandBDBM50155509
Substrate/Competitorn/a
Meas. Tech.ChEBML_1565734
IC50<250±n/a nM
Citation Abdel-Magid, AF Inhibition of Histone Demethylases Offers a Novel and Promising Approach for the Treatment of Cancer and Other Diseases. ACS Med Chem Lett7:128-30 (2016) 
 
Lysine-specific demethylase 2B
Name:Lysine-specific demethylase 2B
Type:Enzyme Catalytic Domain
Mol. Mass.:152658.35
Organism:Homo sapiens (Human)
Description:Q8NHM5
Residue:1336
BDBM50155509
NameBDBM50155509
Synonyms:CHEMBL3780689
TypeSmall organic molecule
Emp. Form.C21H25N3O3
Mol. Mass.367.4415
SMILESC[C@@H](N1CCC[C@H](CNCc2cc(ccn2)C(O)=O)C1=O)c1ccccc1