Reaction Details
TargetREST corepressor 1 [4-485]
LigandBDBM50155766
Substrate/Competitorn/a
Meas. Tech.ChEMBL_1564915 (CHEMBL3782872)
IC50 28±n/a nM
Citation Vianello, PBotrugno, OACappa, ADal Zuffo, RDessanti, PMai, AMarrocco, BMattevi, AMeroni, GMinucci, SStazi, GThaler, FTrifiró, PValente, SVilla, MVarasi, MMercurio, C Discovery of a Novel Inhibitor of Histone Lysine-Specific Demethylase 1A (KDM1A/LSD1) as Orally Active Antitumor Agent. J Med Chem59:1501-17 (2016) 
 
REST corepressor 1 [4-485]
Name:REST corepressor 1 [4-485]
Type:PROTEIN
Mol. Mass.:53029.95
Organism:Homo sapiens (Human)
Description:ChEMBL_108118
Residue:482
BDBM50155766
NameBDBM50155766
Synonyms:CHEMBL3780374
TypeSmall organic molecule
Emp. Form.C19H20ClN3O3
Mol. Mass.373.833
SMILESCl.N[C@@H]1C[C@H]1c1ccc(NC(=O)c2cccc(c2)N2CCOC2=O)cc1