Reaction Details
TargetAmine oxidase [flavin-containing] A
LigandBDBM50155579
Substrate/Competitorn/a
Meas. Tech.ChEMBL_1564916 (CHEMBL3782873)
IC50 31±n/a nM
Citation Vianello, PBotrugno, OACappa, ADal Zuffo, RDessanti, PMai, AMarrocco, BMattevi, AMeroni, GMinucci, SStazi, GThaler, FTrifiró, PValente, SVilla, MVarasi, MMercurio, C Discovery of a Novel Inhibitor of Histone Lysine-Specific Demethylase 1A (KDM1A/LSD1) as Orally Active Antitumor Agent. J Med Chem59:1501-17 (2016) 
 
Amine oxidase [flavin-containing] A
Name:Amine oxidase [flavin-containing] A
Type:Protein
Mol. Mass.:59689.53
Organism:Homo sapiens (Human)
Description:P21397
Residue:527
BDBM50155579
NameBDBM50155579
Synonyms:CHEMBL3546846
TypeSmall organic molecule
Emp. Form.C16H16N2O
Mol. Mass.252.311
SMILESN[C@@H]1C[C@H]1c1ccc(NC(=O)c2ccccc2)cc1