Reaction Details
TargetCannabinoid receptor 1
LigandBDBM50272486
Substrate/Competitorn/a
Meas. Tech.ChEMBL_1565589 (CHEMBL3782258)
Ki 5.3±n/a nM
Citation Mugnaini, CBrizzi, ALigresti, AAllarà, MLamponi, SVacondio, FSilva, CMor, MDi Marzo, VCorelli, F Investigations on the 4-Quinolone-3-carboxylic Acid Motif. 7. Synthesis and Pharmacological Evaluation of 4-Quinolone-3-carboxamides and 4-Hydroxy-2-quinolone-3-carboxamides as High Affinity Cannabinoid Receptor 2 (CB2R) Ligands with Improved Aqueous Solubility. J Med Chem59:1052-67 (2016) 
 
Cannabinoid receptor 1
Name:Cannabinoid receptor 1
Type:G Protein-Coupled Receptor (GPCR)
Mol. Mass.:52868.96
Organism:Homo sapiens (Human)
Description:P21554
Residue:472
BDBM50272486
NameBDBM50272486
Synonyms:CHEMBL498527 | N-(Adamant-1-yl)-4-oxo-1-pentyl-7-(phenylthio)-1,4-dihydroquinoline-3-carboxamide
TypeSmall organic molecule
Emp. Form.C31H36N2O2S
Mol. Mass.500.695
SMILESCCCCCn1cc(C(=O)NC23CC4CC(CC(C4)C2)C3)c(=O)c2ccc(Sc3ccccc3)cc12