Reaction Details
TargetCannabinoid receptor 2
LigandBDBM50156024
Substrate/Competitorn/a
Meas. Tech.ChEMBL_1565590 (CHEMBL3782259)
IC50 3.5±n/a nM
Citation Mugnaini, CBrizzi, ALigresti, AAllarà, MLamponi, SVacondio, FSilva, CMor, MDi Marzo, VCorelli, F Investigations on the 4-Quinolone-3-carboxylic Acid Motif. 7. Synthesis and Pharmacological Evaluation of 4-Quinolone-3-carboxamides and 4-Hydroxy-2-quinolone-3-carboxamides as High Affinity Cannabinoid Receptor 2 (CB2R) Ligands with Improved Aqueous Solubility. J Med Chem59:1052-67 (2016) 
 
Cannabinoid receptor 2
Name:Cannabinoid receptor 2
Type:G Protein-Coupled Receptor (GPCR)
Mol. Mass.:39690.94
Organism:Homo sapiens (Human)
Description:P34972
Residue:360
BDBM50156024
NameBDBM50156024
Synonyms:CHEMBL3780852
TypeSmall organic molecule
Emp. Form.C25H31FN2O3
Mol. Mass.426.5236
SMILESCCCCCn1c2cc(F)ccc2c(O)c(C(=O)NC23CC4CC(CC(C4)C2)C3)c1=O