Reaction Details
TargetCannabinoid receptor 2
LigandBDBM50156099
Substrate/Competitorn/a
Meas. Tech.ChEMBL_1565590 (CHEMBL3782259)
Ki 20±n/a nM
Citation Mugnaini, CBrizzi, ALigresti, AAllarà, MLamponi, SVacondio, FSilva, CMor, MDi Marzo, VCorelli, F Investigations on the 4-Quinolone-3-carboxylic Acid Motif. 7. Synthesis and Pharmacological Evaluation of 4-Quinolone-3-carboxamides and 4-Hydroxy-2-quinolone-3-carboxamides as High Affinity Cannabinoid Receptor 2 (CB2R) Ligands with Improved Aqueous Solubility. J Med Chem59:1052-67 (2016) 
 
Cannabinoid receptor 2
Name:Cannabinoid receptor 2
Type:G Protein-Coupled Receptor (GPCR)
Mol. Mass.:39690.94
Organism:Homo sapiens (Human)
Description:P34972
Residue:360
BDBM50156099
NameBDBM50156099
Synonyms:CHEMBL3780862
TypeSmall organic molecule
Emp. Form.C27H28N2O4S
Mol. Mass.476.587
SMILESCCCCCn1c2ccc(cc2c(O)c(C(=O)NCc2ccc(OC)cc2)c1=O)-c1cccs1