Reaction Details
TargetCannabinoid receptor 2
LigandBDBM50156109
Substrate/Competitorn/a
Meas. Tech.ChEMBL_1563157 (CHEMBL3783895)
Ki>40000±n/a nM
Citation Morales, PWhyte, LSChicharro, RGómez-Cañas, MPazos, MRGoya, PIrving, AJFernández-Ruiz, JRoss, RAJagerovic, N Identification of Novel GPR55 Modulators Using Cell-Impedance-Based Label-Free Technology. J Med Chem59:1840-53 (2016) 
 
Cannabinoid receptor 2
Name:Cannabinoid receptor 2
Type:G Protein-Coupled Receptor (GPCR)
Mol. Mass.:39690.94
Organism:Homo sapiens (Human)
Description:P34972
Residue:360
BDBM50156109
NameBDBM50156109
Synonyms:CHEMBL3781297
TypeSmall organic molecule
Emp. Form.C27H33N5O4
Mol. Mass.491.582
SMILESCOc1ccc(cc1)N1CCN(CC(=O)NCn2ncc3c2-c2ccc(OC)cc2OC3(C)C)CC1