Reaction Details
TargetCannabinoid receptor 2
LigandBDBM50156113
Substrate/Competitorn/a
Meas. Tech.ChEMBL_1563157 (CHEMBL3783895)
Ki>40000±n/a nM
Citation Morales, PWhyte, LSChicharro, RGómez-Cañas, MPazos, MRGoya, PIrving, AJFernández-Ruiz, JRoss, RAJagerovic, N Identification of Novel GPR55 Modulators Using Cell-Impedance-Based Label-Free Technology. J Med Chem59:1840-53 (2016) 
 
Cannabinoid receptor 2
Name:Cannabinoid receptor 2
Type:G Protein-Coupled Receptor (GPCR)
Mol. Mass.:39690.94
Organism:Homo sapiens (Human)
Description:P34972
Residue:360
BDBM50156113
NameBDBM50156113
Synonyms:CHEMBL3780452
TypeSmall organic molecule
Emp. Form.C27H33N5O4
Mol. Mass.491.582
SMILESCOc1ccc2-c3c(cnn3CNC(=O)CN3CCN(CC3)c3ccccc3OC)C(C)(C)Oc2c1