Reaction Details
TargetCannabinoid receptor 1
LigandBDBM50156115
Substrate/Competitorn/a
Meas. Tech.ChEMBL_1563156 (CHEMBL3783894)
Ki>40000±n/a nM
Citation Morales, PWhyte, LSChicharro, RGómez-Cañas, MPazos, MRGoya, PIrving, AJFernández-Ruiz, JRoss, RAJagerovic, N Identification of Novel GPR55 Modulators Using Cell-Impedance-Based Label-Free Technology. J Med Chem59:1840-53 (2016) 
 
Cannabinoid receptor 1
Name:Cannabinoid receptor 1
Type:G Protein-Coupled Receptor (GPCR)
Mol. Mass.:52868.96
Organism:Homo sapiens (Human)
Description:P21554
Residue:472
BDBM50156115
NameBDBM50156115
Synonyms:CHEMBL3781210
TypeSmall organic molecule
Emp. Form.C26H31N5O3
Mol. Mass.461.556
SMILESCOc1ccc2-c3c(cnn3CNC(=O)CN3CCN(CC3)c3ccccc3)C(C)(C)Oc2c1