Reaction Details
TargetG-protein coupled receptor 55
LigandBDBM50156102
Substrate/Competitorn/a
Meas. Tech.ChEMBL_1563025 (CHEMBL3783507)
EC50 8.2±n/a nM
Citation Morales, PWhyte, LSChicharro, RGómez-Cañas, MPazos, MRGoya, PIrving, AJFernández-Ruiz, JRoss, RAJagerovic, N Identification of Novel GPR55 Modulators Using Cell-Impedance-Based Label-Free Technology. J Med Chem59:1840-53 (2016) 
 
G-protein coupled receptor 55
Name:G-protein coupled receptor 55
Type:PROTEIN
Mol. Mass.:36649.72
Organism:Homo sapiens (Human)
Description:ChEMBL_1292265
Residue:319
BDBM50156102
NameBDBM50156102
Synonyms:CHEMBL3781953
TypeSmall organic molecule
Emp. Form.C24H28N4O3S
Mol. Mass.452.569
SMILESCOc1ccc2-c3nn(CCN4CCN(CC4)C(=O)c4cccs4)cc3C(C)(C)Oc2c1