Reaction Details
TargetG-protein coupled receptor 55
LigandBDBM50156115
Substrate/Competitorn/a
Meas. Tech.ChEMBL_1563025 (CHEMBL3783507)
EC50 28±n/a nM
Citation Morales, PWhyte, LSChicharro, RGómez-Cañas, MPazos, MRGoya, PIrving, AJFernández-Ruiz, JRoss, RAJagerovic, N Identification of Novel GPR55 Modulators Using Cell-Impedance-Based Label-Free Technology. J Med Chem59:1840-53 (2016) 
 
G-protein coupled receptor 55
Name:G-protein coupled receptor 55
Type:PROTEIN
Mol. Mass.:36649.72
Organism:Homo sapiens (Human)
Description:ChEMBL_1292265
Residue:319
BDBM50156115
NameBDBM50156115
Synonyms:CHEMBL3781210
TypeSmall organic molecule
Emp. Form.C26H31N5O3
Mol. Mass.461.556
SMILESCOc1ccc2-c3c(cnn3CNC(=O)CN3CCN(CC3)c3ccccc3)C(C)(C)Oc2c1