Reaction Details
TargetG-protein coupled receptor 55
LigandBDBM50156106
Substrate/Competitorn/a
Meas. Tech.ChEMBL_1563021 (CHEMBL3783503)
EC50 1.3±n/a nM
Citation Morales, PWhyte, LSChicharro, RGómez-Cañas, MPazos, MRGoya, PIrving, AJFernández-Ruiz, JRoss, RAJagerovic, N Identification of Novel GPR55 Modulators Using Cell-Impedance-Based Label-Free Technology. J Med Chem59:1840-53 (2016) 
 
G-protein coupled receptor 55
Name:G-protein coupled receptor 55
Type:PROTEIN
Mol. Mass.:36649.72
Organism:Homo sapiens (Human)
Description:ChEMBL_1292265
Residue:319
BDBM50156106
NameBDBM50156106
Synonyms:CHEMBL3779954
TypeSmall organic molecule
Emp. Form.C27H32N4O4
Mol. Mass.476.5674
SMILESCOc1ccc2-c3nn(CCN4CCN(CC4)C(=O)COc4ccccc4)cc3C(C)(C)Oc2c1