Reaction Details
Target5-hydroxytryptamine receptor 6
LigandBDBM50156222
Substrate/Competitorn/a
Meas. Tech.ChEMBL_1563720 (CHEMBL3783931)
IC50 1.2±n/a nM
Citation Blass, B Sulfonamide Derivatives and Pharmaceutical Applications Thereof. ACS Med Chem Lett7:12-4 (2016) 
 
5-hydroxytryptamine receptor 6
Name:5-hydroxytryptamine receptor 6
Type:G Protein-Coupled Receptor (GPCR)
Mol. Mass.:46968.43
Organism:Homo sapiens (Human)
Description:P50406
Residue:440
BDBM50156222
NameBDBM50156222
Synonyms:CHEMBL3779974
TypeSmall organic molecule
Emp. Form.C25H28BrN3O3S
Mol. Mass.530.477
SMILESCOc1ccc(cc1N1CCNCC1)S(=O)(=O)NCC1(CC1)c1cccc2ccc(Br)cc12