Reaction Details
TargetCellular tumor antigen p53
LigandBDBM188519
Substrate/Competitorn/a
Meas. Tech.ChEMBL_1569637 (CHEMBL3790863)
IC50 1500±n/a nM
Citation Romero, FATaylor, AMCrawford, TDTsui, VCôté, AMagnuson, S Disrupting Acetyl-Lysine Recognition: Progress in the Development of Bromodomain Inhibitors. J Med Chem59:1271-98 (2016) 
 
Cellular tumor antigen p53
Name:Cellular tumor antigen p53
Type:fusion protein
Mol. Mass.:43654.73
Organism:Homo sapiens (Human)
Description:The full-length His6-wt-p53 expressed in E. coli was used in assays.
Residue:393
BDBM188519
NameBDBM188519
Synonyms:SGC-CBP30
TypeSmall organic molecule
Emp. Form.C28H33ClN4O3
Mol. Mass.509.04
SMILESCOc1ccc(CCc2nc3cc(ccc3n2C[C@H](C)N2CCOCC2)-c2c(C)noc2C)cc1Cl