Reaction Details
TargetProtein polybromo-1
LigandBDBM50158688
Substrate/Competitorn/a
Meas. Tech.ChEMBL_1569642 (CHEMBL3790868)
Kd 48±n/a nM
Citation Romero, FATaylor, AMCrawford, TDTsui, VCôté, AMagnuson, S Disrupting Acetyl-Lysine Recognition: Progress in the Development of Bromodomain Inhibitors. J Med Chem59:1271-98 (2016) 
 
Protein polybromo-1
Name:Protein polybromo-1
Type:PROTEIN
Mol. Mass.:192953.62
Organism:Homo sapiens (Human)
Description:ChEMBL_104264
Residue:1689
BDBM50158688
NameBDBM50158688
Synonyms:CHEMBL3752911
TypeSmall organic molecule
Emp. Form.C19H19N3O2
Mol. Mass.321.3731
SMILES[H][C@@]12CN(c3ccccn3)[C@@]([H])(CN1\C=C\C(=O)c1ccccc1O)C2