Reaction Details
TargetCasein kinase II subunit alpha
LigandBDBM50156367
Substrate/Competitorn/a
Meas. Tech.ChEMBL_1571428 (CHEMBL3796659)
Ki 150±n/a nM
Citation Ford, MCHo, PS Computational Tools To Model Halogen Bonds in Medicinal Chemistry. J Med Chem59:1655-70 (2016) 
 
Casein kinase II subunit alpha
Name:Casein kinase II subunit alpha
Type:Enzyme
Mol. Mass.:45151.12
Organism:Homo sapiens (Human)
Description:P68400
Residue:391
BDBM50156367
NameBDBM50156367
Synonyms:CHEMBL3793598
TypeSmall organic molecule
Emp. Form.C8H4Br4N2O2S
Mol. Mass.511.811
SMILESCS(=O)(=O)c1nc2c(Br)c(Br)c(Br)c(Br)c2[nH]1