Reaction Details
TargetD(1A) dopamine receptor
LigandBDBM50156813
Substrate/Competitorn/a
Meas. Tech.ChEMBL_1571934 (CHEMBL3796326)
Ki>10000±n/a nM
Citation Witt, JOMcCollum, ALHurtado, MAHuseman, EDJeffries, DETemple, KJPlumley, HCBlobaum, ALLindsley, CWHopkins, CR Synthesis and characterization of a series of chiral alkoxymethyl morpholine analogs as dopamine receptor 4 (D4R) antagonists. Bioorg Med Chem Lett26:2481-8 (2016) 
 
D(1A) dopamine receptor
Name:D(1A) dopamine receptor
Type:Enzyme
Mol. Mass.:49303.43
Organism:Homo sapiens (Human)
Description:P21728
Residue:446
BDBM50156813
NameBDBM50156813
Synonyms:CHEMBL3792751
TypeSmall organic molecule
Emp. Form.C19H19ClFN3O2
Mol. Mass.375.824
SMILESFc1ccc2c(CN3CCO[C@H](COc4cccc(Cl)n4)C3)c[nH]c2c1